{"text_format":"1","workbook":"xlsx","n_sheets":4,"sheets":["Start","Ret_income","Report","Table"],"not_rendered":{"charts":0,"images":0,"macros":1,"external_links":0,"defined_names":9,"comments":1,"pivot_tables":3},"unopened":[],"bounds":{"document_bytes":16777216,"sheet_cells":100000,"rows_first":2000,"rows_last":500,"rows_between":2000,"halvings":0,"cell_chars":16384,"cell_head_chars":4096},"cells_cut":0,"cells_raw":0,"read":"whole","date_system":"1900"}

{"sheet":"Start","index":0,"n_rows":0,"n_cols":0,"rows_kept":0,"cut":false,"hidden":false,"merged":[]}

{"sheet":"Ret_income","index":1,"n_rows":4,"n_cols":55,"rows_kept":4,"cut":false,"hidden":true,"merged":[]}
["RET INCOME ACC","SUB ACC","DESCRIPTION","BRANCH","NEXT YEAR BUDGET","THIS YEAR FORECAST","CURRENT YEAR ACTUAL","LAST YEAR ACTUAL","2 YEARS AGO ACTUAL","LOCKED STATUS","COMPLETED","ACCOUNT TYPE","EXP_CATEGORY","DIV_CATEGORY",null,null,null,"RET INCOME ACC","SUB ACC","DESCRIPTION","BRANCH","NEXT YEAR BUDGET","THIS YEAR FORECAST","CURRENT YEAR ACTUAL","LAST YEAR ACTUAL","2 YEARS AGO ACTUAL","LOCKED STATUS","COMPLETED","ACCOUNT TYPE",null,"RET INCOME ACC","SUB ACC","DESCRIPTION","BRANCH","NEXT YEAR BUDGET","THIS YEAR FORECAST","CURRENT YEAR ACTUAL","LAST YEAR ACTUAL","2 YEARS AGO ACTUAL","LOCKED STATUS","COMPLETED","ACCOUNT TYPE",null,"RET INCOME ACC","SUB ACC","DESCRIPTION","BRANCH","NEXT YEAR BUDGET","THIS YEAR FORECAST","CURRENT YEAR ACTUAL","LAST YEAR ACTUAL","2 YEARS AGO ACTUAL","LOCKED STATUS","COMPLETED","ACCOUNT TYPE"]
[null,null,null,null,null,null,null,null,null,null,null,null,null,null,null,null,null,{"$f":"Report!$I$1","v":"53010000184"},null,null,null,null,null,null,null,null,null,null,"Income",null,{"$f":"Report!$I$1","v":"53010000184"},null,null,null,null,null,null,null,null,null,null,"Expenses",null,{"$f":"Report!$I$1","v":"53010000184"},null,null,null,null,null,null,null,null,null,null,"Transfers"]
[]
[null,null,null,null,null,null,null,null,null,null,null,null,null,null,null,null,null,"RET INCOME ACC","SUB ACC","DESCRIPTION","BRANCH","NEXT YEAR BUDGET","THIS YEAR FORECAST","CURRENT YEAR ACTUAL","LAST YEAR ACTUAL","2 YEARS AGO ACTUAL","LOCKED STATUS","COMPLETED","ACCOUNT TYPE",null,"RET INCOME ACC","SUB ACC","DESCRIPTION","BRANCH","NEXT YEAR BUDGET","THIS YEAR FORECAST","CURRENT YEAR ACTUAL","LAST YEAR ACTUAL","2 YEARS AGO ACTUAL","LOCKED STATUS","COMPLETED","ACCOUNT TYPE",null,"RET INCOME ACC","SUB ACC","DESCRIPTION","BRANCH","NEXT YEAR BUDGET","THIS YEAR FORECAST","CURRENT YEAR ACTUAL","LAST YEAR ACTUAL","2 YEARS AGO ACTUAL","LOCKED STATUS","COMPLETED","ACCOUNT TYPE"]

{"sheet":"Report","index":2,"n_rows":55,"n_cols":27,"rows_kept":55,"cut":false,"hidden":false,"merged":[[54,5,54,6],[48,5,48,6],[49,5,49,6],[50,5,50,6],[52,5,52,6],[53,5,53,6]]}
[null,"RHODES UNIVERSITY",null,null,null,null,{"$f":"TODAY()","v":"2014-08-19"},{"$f":"VLOOKUP(\"Staff Costs\",$J$8:$J$30,1,FALSE)","v":{"$error":"#N/A"}},"53010000184",null,null,null,null,null,null,null,null,null,{"$f":"VLOOKUP(\"Staff Costs\",$R$8:$R$30,1,FALSE)","v":{"$error":"#N/A"}},null,null,null,null,null,{"$f":"VLOOKUP(\"Staff Costs\",$Z$8:$Z$30,1,FALSE)","v":{"$error":"#N/A"}}]
[null,"Enter Division name in this cell"]
[]
[null,"BUDGET 2015","BUDGET","FORECAST","ACTUAL","ACTUAL","ACTUAL",null,null,"ACCOUNT TYPE","Expenses",null,null,null,null,null,null,"ACCOUNT TYPE","Transfers",null,null,null,null,null,null,"ACCOUNT TYPE","Income"]
[null,"EXPENDITURE",2015,2014,"YTD 2014",2013,2012]
[]
[null,"INCOME",{"$f":"SUM(C8:C12)","v":0},{"$f":"SUM(D8:D12)","v":0},0,0,0,null,null,"DIV_CATEGORY",null,null,null,null,null,null,null,"DIV_CATEGORY",null,null,null,null,null,null,null,"DIV_CATEGORY"]
[null,{"$f":"IF(OR($Z8=\"#N/A\",$Z8=\"\"),0,$Z8)","v":0},{"$f":"SUMIFS(Ret_income!E:E,Ret_income!$L:$L,$B$7,Ret_income!$N:$N,$B8)","v":0},{"$f":"SUMIFS(Ret_income!F:F,Ret_income!$L:$L,$B$7,Ret_income!$N:$N,$B8)","v":0},{"$f":"SUMIFS(Ret_income!G:G,Ret_income!$L:$L,$B$7,Ret_income!$N:$N,$B8)","v":0},{"$f":"SUMIFS(Ret_income!H:H,Ret_income!$L:$L,$B$7,Ret_income!$N:$N,$B8)","v":0},{"$f":"SUMIFS(Ret_income!I:I,Ret_income!$L:$L,$B$7,Ret_income!$N:$N,$B8)","v":0},null,null,"Computer Consumables",null,null,null,null,null,null,null,"Training",null,null,null,null,null,null,null,"#N/A"]
[null,{"$f":"IF(OR($Z9=\"#N/A\",$Z9=\"\"),0,$Z9)","v":0},{"$f":"SUMIFS(Ret_income!E:E,Ret_income!$L:$L,$B$7,Ret_income!$N:$N,$B9)","v":0},{"$f":"SUMIFS(Ret_income!F:F,Ret_income!$L:$L,$B$7,Ret_income!$N:$N,$B9)","v":0},{"$f":"SUMIFS(Ret_income!G:G,Ret_income!$L:$L,$B$7,Ret_income!$N:$N,$B9)","v":0},{"$f":"SUMIFS(Ret_income!H:H,Ret_income!$L:$L,$B$7,Ret_income!$N:$N,$B9)","v":0},{"$f":"SUMIFS(Ret_income!I:I,Ret_income!$L:$L,$B$7,Ret_income!$N:$N,$B9)","v":0},null,null,"Maintenance",null,null,null,null,null,null,null,"#N/A"]
[null,0,{"$f":"SUMIFS(Ret_income!E:E,Ret_income!$L:$L,$B$7,Ret_income!$N:$N,$B10)","v":0},{"$f":"SUMIFS(Ret_income!F:F,Ret_income!$L:$L,$B$7,Ret_income!$N:$N,$B10)","v":0},{"$f":"SUMIFS(Ret_income!G:G,Ret_income!$L:$L,$B$7,Ret_income!$N:$N,$B10)","v":0},{"$f":"SUMIFS(Ret_income!H:H,Ret_income!$L:$L,$B$7,Ret_income!$N:$N,$B10)","v":0},{"$f":"SUMIFS(Ret_income!I:I,Ret_income!$L:$L,$B$7,Ret_income!$N:$N,$B10)","v":0},null,null,"Postage & Telephone"]
[null,0,{"$f":"SUMIFS(Ret_income!E:E,Ret_income!$L:$L,$B$7,Ret_income!$N:$N,$B11)","v":0},{"$f":"SUMIFS(Ret_income!F:F,Ret_income!$L:$L,$B$7,Ret_income!$N:$N,$B11)","v":0},{"$f":"SUMIFS(Ret_income!G:G,Ret_income!$L:$L,$B$7,Ret_income!$N:$N,$B11)","v":0},{"$f":"SUMIFS(Ret_income!H:H,Ret_income!$L:$L,$B$7,Ret_income!$N:$N,$B11)","v":0},{"$f":"SUMIFS(Ret_income!I:I,Ret_income!$L:$L,$B$7,Ret_income!$N:$N,$B11)","v":0},null,null,"Printing & Stationery"]
[null,0,{"$f":"SUMIFS(Ret_income!E:E,Ret_income!$L:$L,$B$7,Ret_income!$N:$N,$B12)","v":0},{"$f":"SUMIFS(Ret_income!F:F,Ret_income!$L:$L,$B$7,Ret_income!$N:$N,$B12)","v":0},{"$f":"SUMIFS(Ret_income!G:G,Ret_income!$L:$L,$B$7,Ret_income!$N:$N,$B12)","v":0},{"$f":"SUMIFS(Ret_income!H:H,Ret_income!$L:$L,$B$7,Ret_income!$N:$N,$B12)","v":0},{"$f":"SUMIFS(Ret_income!I:I,Ret_income!$L:$L,$B$7,Ret_income!$N:$N,$B12)","v":0},null,null,"Publishing Costs"]
[null,null,null,null,null,null,null,null,null,"Software"]
[null,"EXPENSES",{"$f":"SUM(C15:C32)","v":0},{"$f":"SUM(D15:D32)","v":0},{"$f":"SUM(E15:E32)","v":0},{"$f":"SUM(F15:F32)","v":0},{"$f":"SUM(G15:G32)","v":0},null,null,"Sundry"]
[null,{"$f":"IF(OR($J8=\"#N/A\",$J8=\"\"),0,$J8)","v":"Computer Consumables"},{"$f":"SUMIFS(Ret_income!E:E,Ret_income!$L:$L,$B$14,Ret_income!$N:$N,$B15)","v":0},{"$f":"SUMIFS(Ret_income!F:F,Ret_income!$L:$L,$B$14,Ret_income!$N:$N,$B15)","v":0},{"$f":"SUMIFS(Ret_income!G:G,Ret_income!$L:$L,$B$14,Ret_income!$N:$N,$B15)","v":0},{"$f":"SUMIFS(Ret_income!H:H,Ret_income!$L:$L,$B$14,Ret_income!$N:$N,$B15)","v":0},{"$f":"SUMIFS(Ret_income!I:I,Ret_income!$L:$L,$B$14,Ret_income!$N:$N,$B15)","v":0},null,null,"Supplies & services"]
[null,{"$f":"IF(OR($J9=\"#N/A\",$J9=\"\"),0,$J9)","v":"Maintenance"},{"$f":"SUMIFS(Ret_income!E:E,Ret_income!$L:$L,$B$14,Ret_income!$N:$N,$B16)","v":0},{"$f":"SUMIFS(Ret_income!F:F,Ret_income!$L:$L,$B$14,Ret_income!$N:$N,$B16)","v":0},{"$f":"SUMIFS(Ret_income!G:G,Ret_income!$L:$L,$B$14,Ret_income!$N:$N,$B16)","v":0},{"$f":"SUMIFS(Ret_income!H:H,Ret_income!$L:$L,$B$14,Ret_income!$N:$N,$B16)","v":0},{"$f":"SUMIFS(Ret_income!I:I,Ret_income!$L:$L,$B$14,Ret_income!$N:$N,$B16)","v":0},null,null,"Travel"]
[null,"Postage & Telephone",{"$f":"SUMIFS(Ret_income!E:E,Ret_income!$L:$L,$B$14,Ret_income!$N:$N,$B17)","v":0},{"$f":"SUMIFS(Ret_income!F:F,Ret_income!$L:$L,$B$14,Ret_income!$N:$N,$B17)","v":0},{"$f":"SUMIFS(Ret_income!G:G,Ret_income!$L:$L,$B$14,Ret_income!$N:$N,$B17)","v":0},{"$f":"SUMIFS(Ret_income!H:H,Ret_income!$L:$L,$B$14,Ret_income!$N:$N,$B17)","v":0},{"$f":"SUMIFS(Ret_income!I:I,Ret_income!$L:$L,$B$14,Ret_income!$N:$N,$B17)","v":0},null,null,"#N/A"]
[null,"Printing & Stationery",{"$f":"SUMIFS(Ret_income!E:E,Ret_income!$L:$L,$B$14,Ret_income!$N:$N,$B18)","v":0},{"$f":"SUMIFS(Ret_income!F:F,Ret_income!$L:$L,$B$14,Ret_income!$N:$N,$B18)","v":0},{"$f":"SUMIFS(Ret_income!G:G,Ret_income!$L:$L,$B$14,Ret_income!$N:$N,$B18)","v":0},{"$f":"SUMIFS(Ret_income!H:H,Ret_income!$L:$L,$B$14,Ret_income!$N:$N,$B18)","v":0},{"$f":"SUMIFS(Ret_income!I:I,Ret_income!$L:$L,$B$14,Ret_income!$N:$N,$B18)","v":0}]
[null,"Publishing Costs",{"$f":"SUMIFS(Ret_income!E:E,Ret_income!$L:$L,$B$14,Ret_income!$N:$N,$B19)","v":0},{"$f":"SUMIFS(Ret_income!F:F,Ret_income!$L:$L,$B$14,Ret_income!$N:$N,$B19)","v":0},{"$f":"SUMIFS(Ret_income!G:G,Ret_income!$L:$L,$B$14,Ret_income!$N:$N,$B19)","v":0},{"$f":"SUMIFS(Ret_income!H:H,Ret_income!$L:$L,$B$14,Ret_income!$N:$N,$B19)","v":0},{"$f":"SUMIFS(Ret_income!I:I,Ret_income!$L:$L,$B$14,Ret_income!$N:$N,$B19)","v":0}]
[null,"Software",{"$f":"SUMIFS(Ret_income!E:E,Ret_income!$L:$L,$B$14,Ret_income!$N:$N,$B20)","v":0},{"$f":"SUMIFS(Ret_income!F:F,Ret_income!$L:$L,$B$14,Ret_income!$N:$N,$B20)","v":0},{"$f":"SUMIFS(Ret_income!G:G,Ret_income!$L:$L,$B$14,Ret_income!$N:$N,$B20)","v":0},{"$f":"SUMIFS(Ret_income!H:H,Ret_income!$L:$L,$B$14,Ret_income!$N:$N,$B20)","v":0},{"$f":"SUMIFS(Ret_income!I:I,Ret_income!$L:$L,$B$14,Ret_income!$N:$N,$B20)","v":0}]
[null,"Sundry",{"$f":"SUMIFS(Ret_income!E:E,Ret_income!$L:$L,$B$14,Ret_income!$N:$N,$B21)","v":0},{"$f":"SUMIFS(Ret_income!F:F,Ret_income!$L:$L,$B$14,Ret_income!$N:$N,$B21)","v":0},{"$f":"SUMIFS(Ret_income!G:G,Ret_income!$L:$L,$B$14,Ret_income!$N:$N,$B21)","v":0},{"$f":"SUMIFS(Ret_income!H:H,Ret_income!$L:$L,$B$14,Ret_income!$N:$N,$B21)","v":0},{"$f":"SUMIFS(Ret_income!I:I,Ret_income!$L:$L,$B$14,Ret_income!$N:$N,$B21)","v":0}]
[null,"Supplies & services",{"$f":"SUMIFS(Ret_income!E:E,Ret_income!$L:$L,$B$14,Ret_income!$N:$N,$B22)","v":0},{"$f":"SUMIFS(Ret_income!F:F,Ret_income!$L:$L,$B$14,Ret_income!$N:$N,$B22)","v":0},{"$f":"SUMIFS(Ret_income!G:G,Ret_income!$L:$L,$B$14,Ret_income!$N:$N,$B22)","v":0},{"$f":"SUMIFS(Ret_income!H:H,Ret_income!$L:$L,$B$14,Ret_income!$N:$N,$B22)","v":0},{"$f":"SUMIFS(Ret_income!I:I,Ret_income!$L:$L,$B$14,Ret_income!$N:$N,$B22)","v":0}]
[null,"Travel",{"$f":"SUMIFS(Ret_income!E:E,Ret_income!$L:$L,$B$14,Ret_income!$N:$N,$B23)","v":0},{"$f":"SUMIFS(Ret_income!F:F,Ret_income!$L:$L,$B$14,Ret_income!$N:$N,$B23)","v":0},{"$f":"SUMIFS(Ret_income!G:G,Ret_income!$L:$L,$B$14,Ret_income!$N:$N,$B23)","v":0},{"$f":"SUMIFS(Ret_income!H:H,Ret_income!$L:$L,$B$14,Ret_income!$N:$N,$B23)","v":0},{"$f":"SUMIFS(Ret_income!I:I,Ret_income!$L:$L,$B$14,Ret_income!$N:$N,$B23)","v":0}]
[null,0,{"$f":"SUMIFS(Ret_income!E:E,Ret_income!$L:$L,$B$14,Ret_income!$N:$N,$B24)","v":0},{"$f":"SUMIFS(Ret_income!F:F,Ret_income!$L:$L,$B$14,Ret_income!$N:$N,$B24)","v":0},{"$f":"SUMIFS(Ret_income!G:G,Ret_income!$L:$L,$B$14,Ret_income!$N:$N,$B24)","v":0},{"$f":"SUMIFS(Ret_income!H:H,Ret_income!$L:$L,$B$14,Ret_income!$N:$N,$B24)","v":0},{"$f":"SUMIFS(Ret_income!I:I,Ret_income!$L:$L,$B$14,Ret_income!$N:$N,$B24)","v":0}]
[null,0,{"$f":"SUMIFS(Ret_income!E:E,Ret_income!$L:$L,$B$14,Ret_income!$N:$N,$B25)","v":0},{"$f":"SUMIFS(Ret_income!F:F,Ret_income!$L:$L,$B$14,Ret_income!$N:$N,$B25)","v":0},{"$f":"SUMIFS(Ret_income!G:G,Ret_income!$L:$L,$B$14,Ret_income!$N:$N,$B25)","v":0},{"$f":"SUMIFS(Ret_income!H:H,Ret_income!$L:$L,$B$14,Ret_income!$N:$N,$B25)","v":0},{"$f":"SUMIFS(Ret_income!I:I,Ret_income!$L:$L,$B$14,Ret_income!$N:$N,$B25)","v":0}]
[null,0,{"$f":"SUMIFS(Ret_income!E:E,Ret_income!$L:$L,$B$14,Ret_income!$N:$N,$B26)","v":0},{"$f":"SUMIFS(Ret_income!F:F,Ret_income!$L:$L,$B$14,Ret_income!$N:$N,$B26)","v":0},{"$f":"SUMIFS(Ret_income!G:G,Ret_income!$L:$L,$B$14,Ret_income!$N:$N,$B26)","v":0},{"$f":"SUMIFS(Ret_income!H:H,Ret_income!$L:$L,$B$14,Ret_income!$N:$N,$B26)","v":0},{"$f":"SUMIFS(Ret_income!I:I,Ret_income!$L:$L,$B$14,Ret_income!$N:$N,$B26)","v":0}]
[null,0,{"$f":"SUMIFS(Ret_income!E:E,Ret_income!$L:$L,$B$14,Ret_income!$N:$N,$B27)","v":0},{"$f":"SUMIFS(Ret_income!F:F,Ret_income!$L:$L,$B$14,Ret_income!$N:$N,$B27)","v":0},{"$f":"SUMIFS(Ret_income!G:G,Ret_income!$L:$L,$B$14,Ret_income!$N:$N,$B27)","v":0},{"$f":"SUMIFS(Ret_income!H:H,Ret_income!$L:$L,$B$14,Ret_income!$N:$N,$B27)","v":0},{"$f":"SUMIFS(Ret_income!I:I,Ret_income!$L:$L,$B$14,Ret_income!$N:$N,$B27)","v":0}]
[null,0,{"$f":"SUMIFS(Ret_income!E:E,Ret_income!$L:$L,$B$14,Ret_income!$N:$N,$B28)","v":0},{"$f":"SUMIFS(Ret_income!F:F,Ret_income!$L:$L,$B$14,Ret_income!$N:$N,$B28)","v":0},{"$f":"SUMIFS(Ret_income!G:G,Ret_income!$L:$L,$B$14,Ret_income!$N:$N,$B28)","v":0},{"$f":"SUMIFS(Ret_income!H:H,Ret_income!$L:$L,$B$14,Ret_income!$N:$N,$B28)","v":0},{"$f":"SUMIFS(Ret_income!I:I,Ret_income!$L:$L,$B$14,Ret_income!$N:$N,$B28)","v":0}]
[null,0,{"$f":"SUMIFS(Ret_income!E:E,Ret_income!$L:$L,$B$14,Ret_income!$N:$N,$B29)","v":0},{"$f":"SUMIFS(Ret_income!F:F,Ret_income!$L:$L,$B$14,Ret_income!$N:$N,$B29)","v":0},{"$f":"SUMIFS(Ret_income!G:G,Ret_income!$L:$L,$B$14,Ret_income!$N:$N,$B29)","v":0},{"$f":"SUMIFS(Ret_income!H:H,Ret_income!$L:$L,$B$14,Ret_income!$N:$N,$B29)","v":0},{"$f":"SUMIFS(Ret_income!I:I,Ret_income!$L:$L,$B$14,Ret_income!$N:$N,$B29)","v":0}]
[null,0,{"$f":"SUMIFS(Ret_income!E:E,Ret_income!$L:$L,$B$14,Ret_income!$N:$N,$B30)","v":0},{"$f":"SUMIFS(Ret_income!F:F,Ret_income!$L:$L,$B$14,Ret_income!$N:$N,$B30)","v":0},{"$f":"SUMIFS(Ret_income!G:G,Ret_income!$L:$L,$B$14,Ret_income!$N:$N,$B30)","v":0},{"$f":"SUMIFS(Ret_income!H:H,Ret_income!$L:$L,$B$14,Ret_income!$N:$N,$B30)","v":0},{"$f":"SUMIFS(Ret_income!I:I,Ret_income!$L:$L,$B$14,Ret_income!$N:$N,$B30)","v":0}]
[null,0,{"$f":"SUMIFS(Ret_income!E:E,Ret_income!$L:$L,$B$14,Ret_income!$N:$N,$B31)","v":0},{"$f":"SUMIFS(Ret_income!F:F,Ret_income!$L:$L,$B$14,Ret_income!$N:$N,$B31)","v":0},{"$f":"SUMIFS(Ret_income!G:G,Ret_income!$L:$L,$B$14,Ret_income!$N:$N,$B31)","v":0},{"$f":"SUMIFS(Ret_income!H:H,Ret_income!$L:$L,$B$14,Ret_income!$N:$N,$B31)","v":0},{"$f":"SUMIFS(Ret_income!I:I,Ret_income!$L:$L,$B$14,Ret_income!$N:$N,$B31)","v":0}]
[null,{"$f":"IF(OR($J29=\"#N/A\",$J29=\"\"),0,$J29)","v":0},{"$f":"SUMIFS(Ret_income!E:E,Ret_income!$L:$L,$B$14,Ret_income!$N:$N,$B32)","v":0},{"$f":"SUMIFS(Ret_income!F:F,Ret_income!$L:$L,$B$14,Ret_income!$N:$N,$B32)","v":0},{"$f":"SUMIFS(Ret_income!G:G,Ret_income!$L:$L,$B$14,Ret_income!$N:$N,$B32)","v":0},{"$f":"SUMIFS(Ret_income!H:H,Ret_income!$L:$L,$B$14,Ret_income!$N:$N,$B32)","v":0},{"$f":"SUMIFS(Ret_income!I:I,Ret_income!$L:$L,$B$14,Ret_income!$N:$N,$B32)","v":0}]
[]
[null,"TRANSFERS",{"$f":"SUM(C35:C44)","v":0},{"$f":"SUM(D35:D44)","v":0},{"$f":"SUM(E35:E44)","v":0},{"$f":"SUM(F35:F44)","v":0},{"$f":"SUM(G35:G44)","v":0}]
[null,{"$f":"IF(OR($R8=\"#N/A\",$R8=\"\"),0,$R8)","v":"Training"},{"$f":"SUMIFS(Ret_income!E:E,Ret_income!$L:$L,$B$34,Ret_income!$N:$N,$B35)","v":0},{"$f":"SUMIFS(Ret_income!F:F,Ret_income!$L:$L,$B$34,Ret_income!$N:$N,$B35)","v":0},{"$f":"SUMIFS(Ret_income!G:G,Ret_income!$L:$L,$B$34,Ret_income!$N:$N,$B35)","v":0},{"$f":"SUMIFS(Ret_income!H:H,Ret_income!$L:$L,$B$34,Ret_income!$N:$N,$B35)","v":0},{"$f":"SUMIFS(Ret_income!I:I,Ret_income!$L:$L,$B$34,Ret_income!$N:$N,$B35)","v":0}]
[null,{"$f":"IF(OR($R9=\"#N/A\",$R9=\"\"),0,$R9)","v":0},{"$f":"SUMIFS(Ret_income!E:E,Ret_income!$L:$L,$B$34,Ret_income!$N:$N,$B36)","v":0},{"$f":"SUMIFS(Ret_income!F:F,Ret_income!$L:$L,$B$34,Ret_income!$N:$N,$B36)","v":0},{"$f":"SUMIFS(Ret_income!G:G,Ret_income!$L:$L,$B$34,Ret_income!$N:$N,$B36)","v":0},{"$f":"SUMIFS(Ret_income!H:H,Ret_income!$L:$L,$B$34,Ret_income!$N:$N,$B36)","v":0},{"$f":"SUMIFS(Ret_income!I:I,Ret_income!$L:$L,$B$34,Ret_income!$N:$N,$B36)","v":0}]
[null,0,{"$f":"SUMIFS(Ret_income!E:E,Ret_income!$L:$L,$B$34,Ret_income!$N:$N,$B37)","v":0},{"$f":"SUMIFS(Ret_income!F:F,Ret_income!$L:$L,$B$34,Ret_income!$N:$N,$B37)","v":0},{"$f":"SUMIFS(Ret_income!G:G,Ret_income!$L:$L,$B$34,Ret_income!$N:$N,$B37)","v":0},{"$f":"SUMIFS(Ret_income!H:H,Ret_income!$L:$L,$B$34,Ret_income!$N:$N,$B37)","v":0},{"$f":"SUMIFS(Ret_income!I:I,Ret_income!$L:$L,$B$34,Ret_income!$N:$N,$B37)","v":0}]
[null,0,{"$f":"SUMIFS(Ret_income!E:E,Ret_income!$L:$L,$B$34,Ret_income!$N:$N,$B38)","v":0},{"$f":"SUMIFS(Ret_income!F:F,Ret_income!$L:$L,$B$34,Ret_income!$N:$N,$B38)","v":0},{"$f":"SUMIFS(Ret_income!G:G,Ret_income!$L:$L,$B$34,Ret_income!$N:$N,$B38)","v":0},{"$f":"SUMIFS(Ret_income!H:H,Ret_income!$L:$L,$B$34,Ret_income!$N:$N,$B38)","v":0},{"$f":"SUMIFS(Ret_income!I:I,Ret_income!$L:$L,$B$34,Ret_income!$N:$N,$B38)","v":0}]
[null,0,{"$f":"SUMIFS(Ret_income!E:E,Ret_income!$L:$L,$B$34,Ret_income!$N:$N,$B39)","v":0},{"$f":"SUMIFS(Ret_income!F:F,Ret_income!$L:$L,$B$34,Ret_income!$N:$N,$B39)","v":0},{"$f":"SUMIFS(Ret_income!G:G,Ret_income!$L:$L,$B$34,Ret_income!$N:$N,$B39)","v":0},{"$f":"SUMIFS(Ret_income!H:H,Ret_income!$L:$L,$B$34,Ret_income!$N:$N,$B39)","v":0},{"$f":"SUMIFS(Ret_income!I:I,Ret_income!$L:$L,$B$34,Ret_income!$N:$N,$B39)","v":0}]
[null,0,{"$f":"SUMIFS(Ret_income!E:E,Ret_income!$L:$L,$B$34,Ret_income!$N:$N,$B40)","v":0},{"$f":"SUMIFS(Ret_income!F:F,Ret_income!$L:$L,$B$34,Ret_income!$N:$N,$B40)","v":0},{"$f":"SUMIFS(Ret_income!G:G,Ret_income!$L:$L,$B$34,Ret_income!$N:$N,$B40)","v":0},{"$f":"SUMIFS(Ret_income!H:H,Ret_income!$L:$L,$B$34,Ret_income!$N:$N,$B40)","v":0},{"$f":"SUMIFS(Ret_income!I:I,Ret_income!$L:$L,$B$34,Ret_income!$N:$N,$B40)","v":0}]
{"$rows_left_out":16}
{"sheet":"Table","index":3,"n_rows":4263,"n_cols":16,"rows_kept":4263,"cut":false,"hidden":true,"merged":[]}
[null,"Rhodes University",null,null,null,null,null,null,"20 2 2013 acc names inserted from Putty","Added 8 9 2013","15300880168","CAMPUS REFURBISHMENT TRF"]
[null,"UNIVERSITY BCS AS AT 31.3.2012",null,null,null,null,null,null,"Added 720 accounts on  19 &20 2 2013","Added 7 11 2013","Added 7.6.2013"]
[null,"Report name : univ bcs 3","fin430a.s",null,null,null,null,null,"Added 12410880168 on 5 4 2013",null,"Added 19.6.2013"]
[null,null,"Acccount number",null,null,null,null,null,"Added 00040045113 on 9 4 2013",null,"Added 6.7.2013"]
["Account Number","Description","1st","2nd","3rd","4th","Function","Division/Department","Department","Sub-department","BCS Account Category","BCS Reference","BCS2 Reference","Expense Category","Owner","Reporting Type"]
["00002021102","ANTHROPO ACAD SALS PERM",2,"021",1,"02","Academic","Academic Departments","Anthropology",null,"Staff Costs",{"$f":"CONCATENATE(H6,K6)","v":"Academic DepartmentsStaff Costs"},{"$f":"CONCATENATE(G6,N6)","v":"AcademicStaff Cost"},"Staff Cost"]
["00002031102","ANTHROPO ACAD SALS OTHER",2,"031",1,"02","Academic","Academic Departments","Anthropology",null,"Staff Costs","Academic DepartmentsStaff Costs","AcademicStaff Cost","Staff Cost"]
["00002035113","ANTHROPO SECR SALS OTHER",2,"035",1,13,"Academic","Academic Departments","Anthropology",null,"Staff Costs","Academic DepartmentsStaff Costs","AcademicStaff Cost","Staff Cost"]
["00002051102","ANTHROPO ACAD SERVICE BON",2,"051",1,"02","Academic","Academic Departments","Anthropology",null,"Staff Costs","Academic DepartmentsStaff Costs","AcademicStaff Cost","Staff Cost"]
["00002055113","ANTHROPO SECR SERVICE BON",2,55,1,13,"Academic","Academic Departments","Anthropology",null,"Staff Costs","Academic DepartmentsStaff Costs","AcademicStaff Cost","Staff Cost"]
["00002071102","ANTHROPO ACAD MEDICAL AID",2,"071",1,"02","Academic","Academic Departments","Anthropology",null,"Staff Costs","Academic DepartmentsStaff Costs","AcademicStaff Cost","Staff Cost"]
["00002101102","ANTHROPO ACAD UIF",2,101,1,"02","Academic","Academic Departments","Anthropology",null,"Staff Costs","Academic DepartmentsStaff Costs","AcademicStaff Cost","Staff Cost"]
["00002105113","ANTHROPO SECR UIF",2,105,1,13,"Academic","Academic Departments","Anthropology",null,"Staff Costs","Academic DepartmentsStaff Costs","AcademicStaff Cost","Staff Cost"]
["00002111102","ANTHROPO ACAD GROUP LIFE",2,111,1,"02","Academic","Academic Departments","Anthropology",null,"Staff Costs","Academic DepartmentsStaff Costs","AcademicStaff Cost","Staff Cost"]
["00002115113","ANTHROPO SECR GROUP LIFE",2,115,1,13,"Academic","Academic Departments","Anthropology",null,"Staff Costs","Academic DepartmentsStaff Costs","AcademicStaff Cost","Staff Cost"]
["00002151102","ANTHROPO ACAD PENSION CON",2,151,1,"02","Academic","Academic Departments","Anthropology",null,"Staff Costs","Academic DepartmentsStaff Costs","AcademicStaff Cost","Staff Cost"]
["00002155113","ANTHROPO SECR PENSION CON",2,155,1,13,"Academic","Academic Departments","Anthropology",null,"Staff Costs","Academic DepartmentsStaff Costs","AcademicStaff Cost","Staff Cost"]
["00002880168","ANTHROPO ACAD SALS TRANSF",2,880,1,68,"Academic","Academic Departments","Anthropology",null,"Staff Costs","Academic DepartmentsStaff Costs","AcademicStaff Cost","Staff Cost"]
["00004021102","DRAMA ACAD SALS PERM",4,"021",1,"02","Academic","Academic Departments","Drama",null,"Staff Costs","Academic DepartmentsStaff Costs","AcademicStaff Cost","Staff Cost"]
["00004024113","DRAMA TECH SALS PERM",4,"024",1,13,"Academic","Academic Departments","Drama",null,"Staff Costs","Academic DepartmentsStaff Costs","AcademicStaff Cost","Staff Cost"]
["00004025113","DRAMA SECR SALS PERM",4,"025",1,13,"Academic","Academic Departments","Drama",null,"Staff Costs","Academic DepartmentsStaff Costs","AcademicStaff Cost","Staff Cost"]
["00004031102","DRAMA ACAD SALS OTHER",4,"031",1,"02","Academic","Academic Departments","Drama",null,"Staff Costs","Academic DepartmentsStaff Costs","AcademicStaff Cost","Staff Cost"]
["00004034113","DRAMA TECH SALS OTHER",4,"034",1,13,"Academic","Academic Departments","Drama",null,"Staff Costs","Academic DepartmentsStaff Costs","AcademicStaff Cost","Staff Cost"]
["00004035113","DRAMA SECR SALS OTHER",4,"035",1,13,"Academic","Academic Departments","Drama",null,"Staff Costs","Academic DepartmentsStaff Costs","AcademicStaff Cost","Staff Cost"]
["00004044102","DRAMA SALS TECH/PROF TEMP",4,44,1,2,"Academic","Academic Departments","Drama",null,"Staff Costs","Academic DepartmentsStaff Costs","AcademicStaff Cost","Staff Cost"]
["00004051102","DRAMA ACAD SERVICE BONUS",4,"051",1,"02","Academic","Academic Departments","Drama",null,"Staff Costs","Academic DepartmentsStaff Costs","AcademicStaff Cost","Staff Cost"]
["00004054113","DRAMA TECH SERVICE BONUS",4,"054",1,13,"Academic","Academic Departments","Drama",null,"Staff Costs","Academic DepartmentsStaff Costs","AcademicStaff Cost","Staff Cost"]
["00004055113","DRAMA SECR SERVICE BONUS",4,"055",1,13,"Academic","Academic Departments","Drama",null,"Staff Costs","Academic DepartmentsStaff Costs","AcademicStaff Cost","Staff Cost"]
["00004071102","DRAMA ACAD MEDICAL AID",4,"071",1,"02","Academic","Academic Departments","Drama",null,"Staff Costs","Academic DepartmentsStaff Costs","AcademicStaff Cost","Staff Cost"]
["00004074113","DRAMA TECH MEDICAL AID",4,"074",1,13,"Academic","Academic Departments","Drama",null,"Staff Costs","Academic DepartmentsStaff Costs","AcademicStaff Cost","Staff Cost"]
["00004075113","DRAMA SECR MEDICAL AID",4,"075",1,13,"Academic","Academic Departments","Drama",null,"Staff Costs","Academic DepartmentsStaff Costs","AcademicStaff Cost","Staff Cost"]
["00004101102","DRAMA ACAD UIF",4,101,1,"02","Academic","Academic Departments","Drama",null,"Staff Costs","Academic DepartmentsStaff Costs","AcademicStaff Cost","Staff Cost"]
["00004104113","DRAMA TECH UIF",4,104,1,13,"Academic","Academic Departments","Drama",null,"Staff Costs","Academic DepartmentsStaff Costs","AcademicStaff Cost","Staff Cost"]
["00004105113","DRAMA SECR UIF",4,105,1,13,"Academic","Academic Departments","Drama",null,"Staff Costs","Academic DepartmentsStaff Costs","AcademicStaff Cost","Staff Cost"]
["00004111102","DRAMA ACAD GROUP LIFE",4,111,1,"02","Academic","Academic Departments","Drama",null,"Staff Costs","Academic DepartmentsStaff Costs","AcademicStaff Cost","Staff Cost"]
["00004114113","DRAMA TECH GROUP LIFE",4,114,1,13,"Academic","Academic Departments","Drama",null,"Staff Costs","Academic DepartmentsStaff Costs","AcademicStaff Cost","Staff Cost"]
["00004115113","DRAMA SECR GROUP LIFE",4,115,1,13,"Academic","Academic Departments","Drama",null,"Staff Costs","Academic DepartmentsStaff Costs","AcademicStaff Cost","Staff Cost"]
["00004151102","DRAMA ACAD PENSION CONTRI",4,151,1,"02","Academic","Academic Departments","Drama",null,"Staff Costs","Academic DepartmentsStaff Costs","AcademicStaff Cost","Staff Cost"]
["00004154113","DRAMA TECH PENSION CONTRI",4,154,1,13,"Academic","Academic Departments","Drama",null,"Staff Costs","Academic DepartmentsStaff Costs","AcademicStaff Cost","Staff Cost"]
["00004155113","DRAMA SECR PENSION CONTRI",4,155,1,13,"Academic","Academic Departments","Drama",null,"Staff Costs","Academic DepartmentsStaff Costs","AcademicStaff Cost","Staff Cost"]
{"$rows_left_out":4223}